memorial art
broader: public social-political art
in scheme: write thesaurus
source: Bisceglia, Marta R. 2025. Graffiti and Chinese Calligraphy: Looking for Identity in Fusion. PhD thesis. Bologna: Alma Mater Studiorum – University of Bologna.
definition: A genre that encompasses graffiti created to commemorate significant events or individuals, serving as a memorial or tribute to a dramatic occurrence or person.
type: Concept

Graffiti Genres
type: Collection
member: memorial art

public social-political art
type: Concept
narrower: memorial art