seal script
type: Concept
alternative label: zhuanshu @zh-latn
narrower: small seal script
narrower: great seal script
preferred label: 篆书 @zh
source: Qiu, X. 2000. Chinese writing (G. L. Mattos & J. Norman, Trans.). Berkeley: Society for the Study of Early China and the Institute of East Asian Studies, University of California.
source: Boltz, W. G. 1994. The origin and early development of the Chinese writing system. New Haven, CT: American Oriental Society.
in scheme: write thesaurus
definition: An ancient Chinese writing forms originated during the Zhou dynasty (c. 1046–256 BC), persisted during the Warring States period (c. 475 – 221 BC) and evolved during the Qin dynasty (221-206 BC). It is characterized by a strong pictographic nature.

small seal script
type: Concept
preferred label: 小篆 @zh
broader: seal script

great seal script
type: Concept
preferred label: 大篆 @zh
broader: seal script

Script Styles
type: Collection
member: seal script