lacquer calligraphy
type: Concept
broader: regular script
in scheme: write thesaurus
alternative label: flat brush script
alternative label: qishu @zh-latn
source: Ouyang, Zhongshi, and Wen F. Fong, eds. 2008. Chinese Calligraphy. New Heaven and London: Yale University Press, 353).
definition: Also known as Flat Brush Script, is a distinctive calligraphic style developed by Jin Nong (金農, 1687-1763) during the Qing dynasty (1644-1911). It is characterized by angular, square-shaped strokes, resembling characters painted with a flat-edged brush.
preferred label: 漆书 @zh

regular script
type: Concept
preferred label: 楷书 @zh
narrower: lacquer calligraphy

Script Styles
type: Collection
member: lacquer calligraphy