Chinese Visual Elements
type: Collection
member: green celadon vase

green celadon vase
type: Concept
broad match: CIT0283304
broader: Chinese ceramics
in scheme: write thesaurus
alternative label: huaping qingci @zh-latn
source: Chinese ceramics
definition: Famous type of green-glazed Chinese procelain traditionally made in Longquan.
preferred label: 花瓶青瓷 @zh

Chinese ceramics
type: Concept
preferred label: 中国陶瓷 @zh
narrower: green celadon vase