ancient Chinese ritual bronzes
type: Concept
preferred label: 青铜器 @zh
related: taotie

Chinese Visual Elements
type: Collection
member: taotie

taotie
type: Concept
source: Taotie
source: taotie (Enciclopedia-dell'-Arte-Antica)
definition: Zoomorphic mask commonly found on ancient Chinese ritual bronzes; it is frontal, bilaterally symmetrical, with a pair of raised eyes and typically no lower jaw area.
in scheme: write thesaurus
preferred label: 饕餮 @zh
related: ancient Chinese ritual bronzes