graffiti panel art
type: Concept
source: Bisceglia Marta R. 2025. Graffiti and Chinese Calligraphy: Looking for Identity in Fusion. PhD thesis. Bologna: Alma Mater Studiorum – University of Bologna.
alternative label: tuya mianban yishu @zh-latn
definition: A type of Chinese graffiti that uses panels as a support, especially used for commissioned and institutional works.
in scheme: write thesaurus
preferred label: 涂鸦面板艺术 @zh

Graffiti Types
type: Collection
member: graffiti panel art