Chinese Visual Elements
type: Collection
member: decorative cloud motif

decorative cloud motif
type: Concept
source: Xiangyun (Auspicious clouds)
alternative label: 祥云 @zh
alternative label: xiangyun @zh-latn
alternative label: auspicious clouds
alternative label: yunwen @zh-latn
definition: Traditional Chinese stylised clouds decorative pattern.
in scheme: write thesaurus
preferred label: 云纹 @zh