Chinese Visual Elements
type: Collection
member: chrysanthemum

chrysanthemum
type: Concept
source: painting-chrysanthemum.php
alternative label: ju @zh-latn
broader: four noble plants
definition: Symbol of autumn and virtue to withstand all adversities. It is one of the “Four Noble Plants” (si junzi).
in scheme: write thesaurus
preferred label: 菊 @zh

four noble plants
type: Concept
narrower: chrysanthemum
preferred label: 四君子 @zh