Vocabolario controllato dei ruoli di Aldo Moro
label: Controlled vocabulary of Aldo Moro's roles @en
type: ConceptScheme

Ruolo
label: Role @en
type: Class
narrower: Professore di Filosofia del Diritto

Professore di Filosofia del Diritto
broader: Ruolo
in scheme: Vocabolario controllato dei ruoli di Aldo Moro
related match: Q1622272
definition: Il ruolo ricoperto da un professore universitario di filosofia del diritto.
preferred label: Professor of Philosophy of Law @en
type: Concept