Presidente nazionale della FUCI
broader: Ruolo
in scheme: Vocabolario controllato dei ruoli di Aldo Moro
related match: Q1255921
definition: Il ruolo ricoperto dal coordinatore delle attività della Federazione Universitaria Cattolica Italiana (FUCI), una federazione di gruppi di studentesse e studenti universitari cattolici.
preferred label: National president of FUCI @en
type: Concept

Ruolo
label: Role @en
type: Class
narrower: Presidente nazionale della FUCI

Vocabolario controllato dei ruoli di Aldo Moro
label: Controlled vocabulary of Aldo Moro's roles @en
type: ConceptScheme