Vocabolario controllato dei ruoli di Aldo Moro
label: Controlled vocabulary of Aldo Moro's roles @en
type: ConceptScheme

Ruolo
label: Role @en
type: Class
narrower: Studente universitario

Studente universitario
broader: Ruolo
in scheme: Vocabolario controllato dei ruoli di Aldo Moro
related match: Q48282
definition: Il ruolo ricoperto da una persona che segue con regolarità un corso di studî universitarî.
preferred label: University student @en
type: Concept