Vocabolario controllato dei ruoli di Aldo Moro
label: Controlled vocabulary of Aldo Moro's roles @en
type: ConceptScheme

Ruolo
label: Role @en
type: Class
narrower: Delegato Diocesano Aspiranti della Gioventù Cattolica

Delegato Diocesano Aspiranti della Gioventù Cattolica
broader: Ruolo
in scheme: Vocabolario controllato dei ruoli di Aldo Moro
related match: Q994779
definition: Il ruolo ricoperto da un rappresentante della Gioventù Cattolica (poi rinominata in Azione Cattolica Italiana), un'associazione cattolica laica finalizzata alla collaborazione con le gerarchie ecclesiastiche della Chiesa cattolica.
preferred label: Diocesan delegate of Catholic Youth's Aspirants @en
type: Concept