Vocabolario controllato dei ruoli di Aldo Moro
type: ConceptScheme
label: Controlled vocabulary of Aldo Moro's roles @en

Ruolo
type: Class
label: Role @en
narrower: Titolare ad interim del ministero degli Esteri

Titolare ad interim del ministero degli Esteri
type: Concept
broader: Ruolo
in scheme: Vocabolario controllato dei ruoli di Aldo Moro
alternative label: Ministro degli Esteri pro tempore
related match: Q7330070
definition: Il ruolo ricoperto dal membro del Governo preposto a rappresentare il proprio Stato e a firmare accordi vincolanti sul piano del diritto internazionale.
preferred label: Acting Minister of Foreign Affairs @en