knowledge base
example: The LiLa project from the University Cattolica Sacro Cuore, https://lila-erc.eu/.
in scheme: KNOT Taxonomy
definition: Una knowledge base (base di conoscenza) è una riserva di conoscenza che contiene regole di inferenza e informazioni sull'esperienza e la competenza umana in un dominio specifico e destinata all'uso da parte di un sistema informativo. Nel contesto di questa tassonomia, una knowledge base deve includere una struttura formale e una semantica. @it
definition: A knowledge base is a store of knowledge that contains inference rules and information about human experience and expertise in a specific domain and intended for use by an information system. Within the context of this taxonomy, a knowledge base must include a formal structure and semantics.
type: Concept
top concept of: KNOT Taxonomy
related: database
related: knowledge graph
alternative label: KB
alternative label: knowledge bases
source: Cook, Merrill. 2020. “Knowledge Base.” Diffblog (blog). Diffbot. April 21, 2020. https://blog.diffbot.com/knowledge-graph-glossary/knowledge-base/. “Iso/Iec 2382:2015.” 2020. ISO. 2020. https://www.iso.org/standard/63598.html. Kejriwal, Mayank. 2019. “What Is a Knowledge Graph?” In Domain-Specific Knowledge Graph Construction, 1–7. Cham: Springer International Publishing.

database
preferred label: banca dati @it
type: Concept
related: knowledge base

knowledge graph
type: Concept
related: knowledge base

KNOT Taxonomy
label: KNOT Tassonomia @it
type: ConceptScheme
has top concept: knowledge base