KNOT Taxonomy
type: ConceptScheme
label: KNOT Tassonomia @it

database
type: Concept
narrower: image database
preferred label: banca dati @it

image database
type: Concept
alternative label: image DB
alternative label: image databases
broader: database
definition: Un tipo di database in cui i dati raccolti, indicizzati e resi disponibili agli utenti sono immagini. @it
definition: A type of database where the primary data being collected, indexed, and made available to users are images.
example: The Medieval Kingdom of Sicily Image Database project from Duke University, https://kos.aahvs.duke.edu/.
in scheme: KNOT Taxonomy
preferred label: banca dati di immagini @it
related match: Researchdatasetsanddatabases