KNOT Thesaurus Tecnologico
label: KNOT Technology Thesaurus @en
type: ConceptScheme
has top concept: SPARQL Endpoint

SPARQL Endpoint
source: “Data.Europa.Eu.” n.d. Europa.Eu. Accessed June 20, 2023. https://data.europa.eu/data/datasets/eu-open-data-portal-sparql-endpoint?locale=it. @en
in scheme: KNOT Thesaurus Tecnologico
definition: A SPARQL Endpoint is a type of communication node on an HTTP network capable of receiving and processing SPARQL requests to allow human and machine users to query databases and return results in a variety of human and machine readable formats. @en
definition: Un endpoint SPARQL è un tipo di nodo di comunicazione su una rete HTTP in grado di ricevere ed elaborare richieste SPARQL per consentire agli utenti umani e meccanici di interrogare i database e restituire i risultati in una varietà di formati leggibili dall'uomo e dalla macchina.
type: Concept
related: Linked Open Data
related: RDF
related: SPARQL
related match: sh2003001435
related match: Concept7.02
related match: Software
related match: endpoint
related match: http://vocab.getty.edu/aat/300028566
top concept of: KNOT Thesaurus Tecnologico

Linked Open Data
type: Concept
related: SPARQL Endpoint

RDF
type: Concept
related: SPARQL Endpoint

SPARQL
type: Concept
related: SPARQL Endpoint

servizio e strumento
preferred label: service & tool @en
type: Collection
member: SPARQL Endpoint