KNOT Thesaurus Tecnologico
label: KNOT Technology Thesaurus @en
type: ConceptScheme

infrastruttura informatica
preferred label: information technology infrastructure @en
type: Collection
member: React

React
definition: React è una libreria open-source di front-end JavaScript utilizzata per costruire interfacce utente a partire da componenti. È gestita da Meta e da una comunità di sviluppatori.
definition: React is an open-source front-end JavaScript library used for building user interfaces from components. It is maintained by Meta and a community of developers. @en
source: “React.” n.d. React.dev. Accessed June 20, 2023. https://react.dev/. @en
type: Concept
alternative label: React.js, ReactJS @en
related match: software
related match: sh96004880
related match: http://vocab.getty.edu/aat/300028566
related match: Software
in scheme: KNOT Thesaurus Tecnologico
related: JavaScript
broader: frontend

JavaScript
type: Concept
related: React

frontend
type: Concept
narrower: React