KNOT Thesaurus Tecnologico
label: KNOT Technology Thesaurus @en
type: ConceptScheme

computer vision
type: Concept
narrower: optical character recognition

optical character recognition
alternative label: OCR @en
source: Weik, Martin H. 2000. “Optical Character Recognition.” In Computer Science and Communications Dictionary, 1160–1160. Boston, MA: Springer US. ———. 2023c. “Optical Character Recognition.” Wikipedia, The Free Encyclopedia. June 16, 2023. https://en.wikipedia.org/w/index.php?title=Optical_character_recognition&oldid=1160427284. @en
definition: Optical Character Recognition is an interdisciplinary field concerned with the mechanical or electronic translation of digital images of written or printed text into machine-encoded text. @en
definition: Optical Character Recognition è un campo interdisciplinare che si occupa della traduzione meccanica o elettronica di immagini digitali di testi scritti o stampati in testi codificati da macchine.
broader: computer vision
type: Concept
in scheme: KNOT Thesaurus Tecnologico

scienze informatiche
preferred label: computer & information sciences @en
type: Collection
member: optical character recognition