KNOT Thesaurus Tecnologico
label: KNOT Technology Thesaurus @en
type: ConceptScheme

backend
type: Concept
narrower: Node.js

infrastruttura informatica
preferred label: information technology infrastructure @en
type: Collection
member: Node.js

Node.js
definition: Node.js is an open-source, cross-platform JavaScript runtime environment. It is asynchronous and event-driven and enables the unification of the development of web applications around a single programming language. It is most commonly used to generate dynamic web page content on the server-side. @en
definition: Node.js è un ambiente runtime JavaScript open-source e multipiattaforma. È asincrono e guidato dagli eventi e consente di unificare lo sviluppo di applicazioni web attorno a un unico linguaggio di programmazione. È più comunemente usato per generare contenuti dinamici di pagine web sul lato server.
source: “About.” n.d. Node.Js. Accessed June 20, 2023. https://nodejs.org/en/about. @en
in scheme: KNOT Thesaurus Tecnologico
related: JavaScript
related match: software
related match: sh96004880
related match: http://vocab.getty.edu/aat/300028566
related match: Software
broader: backend
type: Concept

JavaScript
type: Concept
related: Node.js