named entity recognition
type: Concept
broader: natural language processing
definition: Named Entity Recognition is a type of Information Extraction technique used to automatically identify, segment, and label named entities mentioned in unstructured text into pre-defined categories such as person names, organizations, locations, medical codes, time expressions, quantities, monetary values, percentages, etc.
definition: Named Entity Recognition è un tipo di tecnica di estrazione dell'informazione utilizzata per identificare, segmentare ed etichettare automaticamente le entità nominate citate in un testo non strutturato in categorie predefinite come nomi di persone, organizzazioni, località, codici medici, espressioni temporali, quantità, valori monetari, percentuali, ecc. @it
in scheme: KNOT Technology Thesaurus
alternative label: NER
source: Humbel, Marco, Julianne Nyhan, Andreas Vlachidis, Kim Sloan, and Alexandra Ortolja-Baird. 2021. “Named-Entity Recognition for Early Modern Textual Documents: A Review of Capabilities and Challenges with Strategies for the Future.” The Journal of Documentation; Devoted to the Recording, Organization and Dissemination of Specialized Knowledge 77 (6): 1223–47. https://doi.org/10.1108/jd-02-2021-0032. Wikipedia contributors. 2023a. “Named-Entity Recognition.” Wikipedia, The Free Encyclopedia. May 23, 2023. https://en.wikipedia.org/w/index.php?title=Named-entity_recognition&oldid=1156643335.

KNOT Technology Thesaurus
label: KNOT Thesaurus Tecnologico @it
type: ConceptScheme

natural language processing
type: Concept
narrower: named entity recognition

computer & information sciences
preferred label: scienze informatiche @it
type: Collection
member: named entity recognition