KNOT Thesaurus Tecnologico
label: KNOT Technology Thesaurus @en
type: ConceptScheme

infrastruttura informatica
preferred label: information technology infrastructure @en
type: Collection
member: Linked Data

RDF
type: Concept
related: Linked Data

metadati
preferred label: metadata @en
type: Concept
narrower: Linked Data

Linked Data
broader: metadati
in scheme: KNOT Thesaurus Tecnologico
related: RDF
source: Gottron, Thomas, and Steffen Staab. 2014. “Linked Open Data.” In Encyclopedia of Social Network Analysis and Mining, 811–13. New York, NY: Springer New York. “Linked Data Glossary.” n.d. Www.w3.org. Accessed June 20, 2023. https://www.w3.org/TR/ld-glossary/. @en
definition: Linked Data refers to data that follows a paradigm based on four rules established by Tim Berners-Lee. Linked Data is intended to be readable by both humans and machine, to be interlinked, and to be semantically queryable. It uses the RDF family of standards for data interchange (e.g., RDF/XML, RDFa, Turtle) and query (SPARQL). @en
definition: I Linked Data si riferiscono a dati che seguono un paradigma basato su quattro regole stabilite da Tim Berners-Lee. I Linked Data sono destinati a essere leggibili sia dall'uomo che dalle macchine, a essere interconnessi e a essere interrogabili semanticamente. Utilizza la famiglia di standard RDF per l'interscambio dei dati (ad esempio, RDF/XML, RDFa, Turtle) e l'interrogazione (SPARQL).
type: Concept
related match: Concept59