KNOT Thesaurus Tecnologico
label: KNOT Technology Thesaurus @en
type: ConceptScheme

infrastruttura informatica
preferred label: information technology infrastructure @en
type: Collection
member: Leaflet

JavaScript
type: Concept
related: Leaflet

Leaflet
related match: http://vocab.getty.edu/aat/300028566
related match: software
related match: sh96004880
related match: Software
source: “Leaflet — an Open-Source JavaScript Library for Interactive Maps.” n.d. Leafletjs.com. Accessed June 20, 2023. https://leafletjs.com/. @en
definition: Leaflet è una libreria JavaScript open-source per la creazione di applicazioni web incentrate su mappe interattive. È estensibile e supporta una varietà di livelli e formati GIS.
definition: Leaflet is an open-source JavaScript library for building web applications focused on interactive maps. It is extensible and supports a variety of layers and GIS formats. @en
type: Concept
in scheme: KNOT Thesaurus Tecnologico
broader: frontend
related: JavaScript

frontend
type: Concept
narrower: Leaflet