linguaggio formale
preferred label: formal language @en
type: Collection
member: JSON-LD

KNOT Thesaurus Tecnologico
label: KNOT Technology Thesaurus @en
type: ConceptScheme

linguaggio markup
preferred label: markup language @en
type: Concept
narrower: JSON-LD

JSON-LD
broader: linguaggio markup
type: Concept
definition: JSON-LD è un formato basato su JSON per serializzare i Linked Data, progettato per integrarsi con i sistemi che già utilizzano JSON e destinato a promuovere l'uso dei Linked Data in ambienti di programmazione basati sul web, servizi web e motori di archiviazione basati su JSON.
definition: JSON-LD is a JSON-based format to serialize Linked Data, designed to integrate with systems that already use JSON and intended to foster the use of Linked Data in web-based programming environments, web services, and JSON-based storage engines. @en
source: Longley, Dave. n.d. “Json-Ld 1.1.” Www.w3.org. Accessed June 20, 2023. https://www.w3.org/TR/json-ld/. @en
related match: sh2002000569
related match: Concept59
related match: sh2014000515
related match: sh2013002090
related match: Concept59.01
in scheme: KNOT Thesaurus Tecnologico