KNOT Thesaurus Tecnologico
label: KNOT Technology Thesaurus @en
type: ConceptScheme

backend
type: Concept
narrower: Elasticsearch

infrastruttura informatica
preferred label: information technology infrastructure @en
type: Collection
member: Elasticsearch

Java
type: Concept
related: Elasticsearch

Elasticsearch
type: Concept
definition: Elasticsearch è un motore di ricerca e un software di analisi scritto in Java e basato sulla libreria Lucene. È un motore distribuito e RESTful che archivia i dati in modo centralizzato per migliorare la velocità e la pertinenza e fornisce un'interfaccia HTTP e documenti JSON.
definition: Elasticsearch is a search engine and analytics software written in Java and based on the Lucene library. It is a distributed, RESTful engine that stores data centrally for improved speeds and relevancy and provides an HTTP interface and JSON documents. @en
source: Blokdyk, Gerard. 2018. Elasticsearch: Your Complete Guide. North Charleston, SC: Createspace Independent Publishing Platform. @en
related match: http://vocab.getty.edu/aat/300028566
related match: Software
related match: software
related match: Concept45
related match: sh98007624
related: Java
broader: backend
in scheme: KNOT Thesaurus Tecnologico