KNOT Thesaurus Tecnologico
label: KNOT Technology Thesaurus @en
type: ConceptScheme

infrastruttura informatica
preferred label: information technology infrastructure @en
type: Collection
member: Dublin Core

RDF
type: Concept
related: Dublin Core

metadati
preferred label: metadata @en
type: Concept
narrower: Dublin Core

Dublin Core
alternative label: DC, DCMI, DCMI Metadata Terms @en
definition: Dublin Core è un insieme di elementi di metadati per la descrizione di risorse fisiche e digitali gestito dalla Dublin Core Metadata Initiative. Il suo nucleo originario di quindici elementi fa ora parte del più ampio DCMI Metadata Terms, che si riferisce a proprietà, classi, schemi di codifica del vocabolario e tipi di dati definiti secondo RDF e lo schema concettuale SKOS.
definition: Dublin Core is a set of metadata items for the description of physical and digital resources maintained by the Dublin Core Metadata Initiative. Its original core set of fifteen elements is now part of the larger DCMI Metadata Terms, which refers to properties, classes, vocabulary encoding schemes, and datatypes defined according to RDF and the SKOS Concept Scheme. @en
related match: http://vocab.getty.edu/aat/300266741
related match: Concept40.02
related match: sh2005006014
in scheme: KNOT Thesaurus Tecnologico
type: Concept
source: “DCMI Metadata Terms.” 2012. Dublincore.org. August 12, 2012. https://www.dublincore.org/resources/glossary/dcmi_metadata_terms/. @en
related: RDF
broader: metadati