linguaggio formale
type: Collection
preferred label: formal language @en
member: Python

KNOT Thesaurus Tecnologico
type: ConceptScheme
label: KNOT Technology Thesaurus @en

linguaggio di programmazione
type: Concept
preferred label: programming language @en
narrower: Python

Python
type: Concept
in scheme: KNOT Thesaurus Tecnologico
source: Nagar, Sandeep. 2019. “Python.” In Encyclopedia of Big Data Technologies, 1321–24. Cham: Springer International Publishing. “Welcome To.” n.d. Python.org. Accessed June 20, 2023. https://www.python.org/about/. @en
broader: linguaggio di programmazione
definition: Python è un linguaggio di programmazione di alto livello e di uso generale, progettato per enfatizzare la leggibilità del codice, con il supporto di diversi paradigmi di programmazione e con una libreria standard completa che lo ha reso popolare per le applicazioni del mondo reale.
definition: Python is a high-level, general-purpose programming language designed to emphasize code readability and with support for multiple programming paradigms and with a comprehensive standard library that has made it popular for real-world applications. @en