graph database
type: Concept
related match: sh86007767
related match: Concept51.01
related match: http://vocab.getty.edu/aat/300028543
related match: Researchdatasetsanddatabases
related match: http://vocab.getty.edu/aat/300027020
related match: knowledge graph
source: Wood, Peter T. 2009. “Graph Database.” In Encyclopedia of Database Systems, 1263–66. Boston, MA: Springer US. Angles, Renzo, and Claudio Gutierrez. 2008. “Survey of Graph Database Models.” ACM Computing Surveys 40 (1): 1–39. https://doi.org/10.1145/1322432.1322433.
in scheme: KNOT Technology Thesaurus
alternative label: GDB, graph data model, graph databases
definition: Un tipo di database che utilizza una struttura a grafo per rappresentare e memorizzare i dati come nodi, bordi e proprietà. I database a grafo devono consentire la manipolazione tramite operazioni orientate al grafo e applicare vincoli di integrità per garantire la coerenza dei dati. @it
definition: A type of database that uses a graph structure to represent and store data as nodes, edges, and properties. Graph databases are expected to allow manipulation via graph-oriented operations and to apply integrity constraints to enforce data consistency.
narrower: Blazegraph
preferred label: database a grafo @it
top concept of: KNOT Technology Thesaurus

Blazegraph
type: Concept
broader: graph database

KNOT Technology Thesaurus
type: ConceptScheme
label: KNOT Thesaurus Tecnologico @it
has top concept: graph database

data storage
type: Collection
preferred label: memorizzazione di informazioni @it
member: graph database