KNOT Thesaurus Tecnologico
type: ConceptScheme
label: KNOT Technology Thesaurus @en

linguaggio formale
type: Collection
member: SPARQL
preferred label: formal language @en

linguaggio di query
type: Concept
narrower: SPARQL
preferred label: query language @en

RDF
type: Concept
related: SPARQL

SPARQL
type: Concept
source: “SPARQL 1.1 Query Language.” n.d. Www.w3.org. Accessed June 20, 2023. https://www.w3.org/TR/sparql11-query/. @en
alternative label: SPARQL Protocol and RDF Query Language @en
broader: linguaggio di query
definition: SPARQL is a query language for RDF widely used as a means to semantically query databases. It can be used across native RDF data or data viewed as RDF via middleware and allows for queries using triple patterns, conjunctions, disjunctions, and optional patterns. Results can be returned as sets or RDF graphs. @en
definition: SPARQL è un linguaggio di interrogazione per RDF ampiamente utilizzato come mezzo per interrogare semanticamente i database. Può essere utilizzato su dati RDF nativi o su dati visualizzati come RDF tramite middleware e consente di effettuare interrogazioni utilizzando schemi di triple, congiunzioni, disgiunzioni e schemi opzionali. I risultati possono essere restituiti come insiemi o grafi RDF.
in scheme: KNOT Thesaurus Tecnologico
related: SPARQL Endpoint
related: RDF

SPARQL Endpoint
type: Concept
related: SPARQL