KNOT Thesaurus Tecnologico
type: ConceptScheme
label: KNOT Technology Thesaurus @en

framework
type: Concept
narrower: Muruca

infrastruttura informatica
type: Collection
member: Muruca
preferred label: information technology infrastructure @en

Muruca
type: Concept
source: “Muruca.” 2011. Net7. December 20, 2011. https://www.netseven.it/project/muruca/. @en
broader: framework
definition: Muruca è un framework creato da Net7 per la gestione di oggetti e collezioni digitali che combina diversi moduli e applicazioni open-source nel suo back-end e front-end. È stato originariamente sviluppato per produrre edizioni digitali ed è destinato all'uso in progetti di Digital Humanities.
definition: Muruca is a framework created by Net7 for the management of digital objects and digital collections that combines various open-source modules and applications in its back- and frontend. It was originally developed to produce digital editions and is aimed for usage in Digital Humanities projects. @en
in scheme: KNOT Thesaurus Tecnologico
related match: Software
related match: http://vocab.getty.edu/aat/300028566
related match: software