KNOT Technology Thesaurus
type: ConceptScheme
label: KNOT Thesaurus Tecnologico @it

information technology infrastructure
type: Collection
member: MODS
preferred label: infrastruttura informatica @it

metadata
type: Concept
narrower: MODS
preferred label: metadati @it

MODS
type: Concept
source: Wikipedia Contributors. 2023d. “Metadata Object Description Schema.” Wikipedia, The Free Encyclopedia. June 6, 2023. https://en.wikipedia.org/w/index.php?title=Metadata_Object_Description_Schema&oldid=1158790814.
alternative label: Metadata Object Description Schema
broader: metadata
definition: The Metadata Object Description Schema (MODS) is an XML-based bibliographic description schema developed by the Library of Congress and designed as a compromise between the complexity of the MARC format used by libraries and the extreme simplicity of Dublin Core metadata.
definition: Il Metadata Object Description Schema (MODS) è uno schema di descrizione bibliografica basato su XML sviluppato dalla Biblioteca del Congresso e concepito come compromesso tra la complessità del formato MARC utilizzato dalle biblioteche e l'estrema semplicità dei metadati Dublin Core. @it
in scheme: KNOT Technology Thesaurus
related: XML
related match: sh2005006014
related match: Concept40.02
related match: http://vocab.getty.edu/aat/300266741

XML
type: Concept
related: MODS