KNOT Thesaurus Tecnologico
type: ConceptScheme
label: KNOT Technology Thesaurus @en

frontend
type: Concept
narrower: Leaflet

infrastruttura informatica
type: Collection
member: Leaflet
preferred label: information technology infrastructure @en

JavaScript
type: Concept
related: Leaflet

Leaflet
type: Concept
source: “Leaflet — an Open-Source JavaScript Library for Interactive Maps.” n.d. Leafletjs.com. Accessed June 20, 2023. https://leafletjs.com/. @en
broader: frontend
definition: Leaflet è una libreria JavaScript open-source per la creazione di applicazioni web incentrate su mappe interattive. È estensibile e supporta una varietà di livelli e formati GIS.
definition: Leaflet is an open-source JavaScript library for building web applications focused on interactive maps. It is extensible and supports a variety of layers and GIS formats. @en
in scheme: KNOT Thesaurus Tecnologico
related: JavaScript
related match: http://vocab.getty.edu/aat/300028566
related match: software
related match: sh96004880
related match: Software