KNOT Thesaurus Tecnologico
type: ConceptScheme
label: KNOT Technology Thesaurus @en

API
type: Concept
related: IIIF

framework
type: Concept
narrower: IIIF

IIIF
type: Concept
source: “Home.” n.d. Iiif.Io. Accessed June 20, 2023. https://iiif.io/. @en
alternative label: International Image Interoperability Framework @en
broader: framework
definition: A set of open standards and APIs, developed by an international community and backed by a consortium of leading cultural institutions, for delivering high-quality, attributed digital objects online at scale. @en
definition: Un insieme di standard aperti e di API, sviluppati da una comunità internazionale e sostenuti da un consorzio di istituzioni culturali di primo piano, per fornire online oggetti digitali di alta qualità e attribuiti su scala.
in scheme: KNOT Thesaurus Tecnologico
related: API
related match: Software
related match: sh96004880
related match: http://vocab.getty.edu/aat/300028566
related match: software

infrastruttura informatica
type: Collection
member: IIIF
preferred label: information technology infrastructure @en