KNOT Thesaurus Tecnologico
type: ConceptScheme
label: KNOT Technology Thesaurus @en

Blazegraph
type: Concept
source: “Blazegraph Database.” n.d. Blazegraph.com. Accessed June 20, 2023. https://blazegraph.com/. @en
alternative label: Blazegraph™ DB @en
broader: triplestore
broader: database a grafo
definition: Blazegraph è un database a grafo open-source, scritto in Java, che supporta le API Blueprints e RDF/SPARQL. È utilizzato dal Wikidata Query Service.
definition: Blazegraph is an open-source graph database software, written in Java, that supports Blueprints and RDF/SPARQL APIs. It is used by the Wikidata Query Service. @en
in scheme: KNOT Thesaurus Tecnologico

memorizzazione di informazioni
type: Collection
member: Blazegraph
preferred label: data storage @en

database a grafo
type: Concept
narrower: Blazegraph
preferred label: graph database @en

triplestore
type: Concept
narrower: Blazegraph